Target
Prostaglandin G/H synthase 2
Ligand
BDBM50373548
Substrate
Meas. Tech.
ChEMBL_468015 (CHEMBL947226)
IC50
>10000±n/a nM
Citation
 Orjales, AMosquera, RLópez, BOlivera, RLabeaga, LNúñez, MT Novel 2-(4-methylsulfonylphenyl)pyrimidine derivatives as highly potent and specific COX-2 inhibitors. Bioorg Med Chem 16:2183-99 (2008)  
Target
Name:
Prostaglandin G/H synthase 2
Synonyms:
COX2 Cyclooxygenase 2 (COX-2) Cyclooxygenase-2 (COX-2 AA) Cyclooxygenase-2 (COX-2) PGH2_HUMAN PHS II Prostaglandin E synthase/G/H synthase 2 Prostaglandin-endoperoxide synthase 2
Type:
Enzyme
Mol. Mass.:
69003.89
Organism:
Homo sapiens (Human)
Description:
Recombinant Cox-2 provided by Cayman (Cayman Chemical Co.,Ann Arbor, MI).
Residue:
604
  
Inhibitor
Name:
BDBM50373548
Synonyms:
CHEMBL257301
Type:
Small organic molecule
Emp. Form.:
C20H16F3N5O2S
Mol. Mass.:
447.434
SMILES:
CS(=O)(=O)c1ccc(cc1)-c1nc(NCc2nc3ccccc3[nH]2)cc(n1)C(F)(F)F
: