Target
Neuropeptide Y receptor type 5
Ligand
BDBM50373641
Substrate
Meas. Tech.
ChEMBL_468024 (CHEMBL948247)
Ki
164±n/a nM
Citation
 Li, GStamford, AWHuang, YCheng, KCCook, JFarley, CGao, JGhibaudi, LGreenlee, WJGuzzi, Mvan Heek, MHwa, JJKelly, JMullins, DParker, EMWainhaus, SZhang, X Discovery of novel orally active ureido NPY Y5 receptor antagonists. Bioorg Med Chem Lett 18:1146-50 (2008)  
Target
Name:
Neuropeptide Y receptor type 5
Synonyms:
NPY-Y5 NPY5-R NPY5R_HUMAN NPYY5 Neuropeptide Y receptor type 5 ( NPY Y5) | Y5 receptor
Type:
Enzyme
Mol. Mass.:
50746.64
Organism:
Homo sapiens (Human)
Description:
Q15761
Residue:
445
  
Inhibitor
Name:
BDBM50373641
Synonyms:
CHEMBL272964
Type:
Small organic molecule
Emp. Form.:
C21H32N4O4S
Mol. Mass.:
436.568
SMILES:
CN(C1CCN(CC1)S(C)(=O)=O)C(=O)NC1CCN(CC1)c1cccc(c1)C(C)=O
: