Target
Neuropeptide Y receptor type 5
Ligand
BDBM50373655
Substrate
Meas. Tech.
ChEMBL_468024 (CHEMBL948247)
Ki
2.8±n/a nM
Citation
 Li, GStamford, AWHuang, YCheng, KCCook, JFarley, CGao, JGhibaudi, LGreenlee, WJGuzzi, Mvan Heek, MHwa, JJKelly, JMullins, DParker, EMWainhaus, SZhang, X Discovery of novel orally active ureido NPY Y5 receptor antagonists. Bioorg Med Chem Lett 18:1146-50 (2008)  
Target
Name:
Neuropeptide Y receptor type 5
Synonyms:
NPY-Y5 NPY5-R NPY5R_HUMAN NPYY5 Neuropeptide Y receptor type 5 ( NPY Y5) | Y5 receptor
Type:
Enzyme
Mol. Mass.:
50746.64
Organism:
Homo sapiens (Human)
Description:
Q15761
Residue:
445
  
Inhibitor
Name:
BDBM50373655
Synonyms:
CHEMBL257707
Type:
Small organic molecule
Emp. Form.:
C20H30F2N4O3S
Mol. Mass.:
444.539
SMILES:
CCS(=O)(=O)N1CCC(CC1)N(C)C(=O)NC1CCN(CC1)c1cc(F)cc(F)c1
: