Target
Neuropeptide Y receptor type 4
Ligand
BDBM50373626
Substrate
Meas. Tech.
ChEMBL_468030 (CHEMBL948253)
Ki
>10000±n/a nM
Citation
 Li, GStamford, AWHuang, YCheng, KCCook, JFarley, CGao, JGhibaudi, LGreenlee, WJGuzzi, Mvan Heek, MHwa, JJKelly, JMullins, DParker, EMWainhaus, SZhang, X Discovery of novel orally active ureido NPY Y5 receptor antagonists. Bioorg Med Chem Lett 18:1146-50 (2008)  
Target
Name:
Neuropeptide Y receptor type 4
Synonyms:
NPY-Y4 NPY4R PP1 Pancreatic polypeptide receptor 1
Type:
Enzyme Catalytic Domain
Mol. Mass.:
42207.58
Organism:
Homo sapiens (Human)
Description:
NPY-Y4 PPYR1 HUMAN::P50391
Residue:
375
  
Inhibitor
Name:
BDBM50373626
Synonyms:
CHEMBL257940
Type:
Small organic molecule
Emp. Form.:
C21H29F2N3O2
Mol. Mass.:
393.4707
SMILES:
CN(C1CCN(CC1)C(C)=O)C(=O)N[C@H]1CC[C@@H](CC1)c1cc(F)cc(F)c1
: