Target
Histone deacetylase 1
Ligand
BDBM50373675
Substrate
Meas. Tech.
ChEMBL_468074 (CHEMBL931658)
IC50
200±n/a nM
Citation
 Paquin, IRaeppel, SLeit, SGaudette, FZhou, NMoradei, OSaavedra, OBernstein, NRaeppel, FBouchain, GFréchette, SWoo, SHVaisburg, AFournel, MKalita, ARobert, MFLu, ATrachy-Bourget, MCYan, PTLiu, JRahil, JMacLeod, ARBesterman, JMLi, ZDelorme, D Design and synthesis of 4-[(s-triazin-2-ylamino)methyl]-N-(2-aminophenyl)-benzamides and their analogues as a novel class of histone deacetylase inhibitors. Bioorg Med Chem Lett 18:1067-71 (2008)  
Target
Name:
Histone deacetylase 1
Synonyms:
Cereblon/Histone deacetylase 1 HDAC1 Histone deacetylase 1 (HDAC1) RPD3L1
Type:
Enzyme
Mol. Mass.:
55090.27
Organism:
Homo sapiens (Human)
Description:
Q13547
Residue:
482
  
Inhibitor
Name:
BDBM50373675
Synonyms:
CHEMBL404054
Type:
Small organic molecule
Emp. Form.:
C26H26N8O
Mol. Mass.:
466.5376
SMILES:
Nc1nc(NCc2ccc(cc2)C(=O)Nc2ccccc2N)nc(NC2Cc3ccccc3C2)n1
: