Target
Beta-secretase 1
Ligand
BDBM50373813
Substrate
Meas. Tech.
ChEMBL_468538 (CHEMBL931963)
IC50
1900±n/a nM
Citation
 Clarke, BDemont, EDingwall, CDunsdon, RFaller, AHawkins, JHussain, IMacPherson, DMaile, GMatico, RMilner, PMosley, JNaylor, AO'Brien, ARedshaw, SRiddell, DRowland, PSoleil, VSmith, KJStanway, SStemp, GSweitzer, STheobald, PVesey, DWalter, DSWard, JWayne, G BACE-1 inhibitors part 1: identification of novel hydroxy ethylamines (HEAs). Bioorg Med Chem Lett 18:1011-6 (2008)  
Target
Name:
Beta-secretase 1
Synonyms:
ASP2 Aspartyl protease 2 BACE1 Beta-secretase (BACE) Beta-secretase 1 (BACE 1) Beta-secretase 1 (BACE1) Beta-site amyloid precursor protein cleaving enzyme 1 Memapsin-2 beta-Secretase (BACE-1) | beta-Secretase (BACE1)
Type:
Protein
Mol. Mass.:
55755.10
Organism:
Homo sapiens (Human)
Description:
P56817
Residue:
501
  
Inhibitor
Name:
BDBM50373813
Synonyms:
CHEMBL271437
Type:
Small organic molecule
Emp. Form.:
C29H40N4O5S
Mol. Mass.:
556.717
SMILES:
C[C@H](NC[C@@H](O)[C@H](Cc1ccccc1)NC(=O)c1cccc(c1)N1CCCS1(=O)=O)C(=O)NC1CCCCC1
: