Target
Muscarinic acetylcholine receptor M3
Ligand
BDBM50373835
Substrate
Meas. Tech.
ChEMBL_468551 (CHEMBL930975)
IC50
>150000±n/a nM
Citation
 Lewis, LMSheffler, DWilliams, RBridges, TMKennedy, JPBrogan, JTMulder, MJWilliams, LNalywajko, NTNiswender, CMWeaver, CDConn, PJLindsley, CW Synthesis and SAR of selective muscarinic acetylcholine receptor subtype 1 (M1 mAChR) antagonists. Bioorg Med Chem Lett 18:885-90 (2008)  
Target
Name:
Muscarinic acetylcholine receptor M3
Synonyms:
ACM3_RAT Chrm-3 | Chrm3
Type:
Enzyme Catalytic Domain
Mol. Mass.:
66086.66
Organism:
RAT
Description:
Cholinergic, muscarinic M3 CHRM3 RAT::P08483
Residue:
589
  
Inhibitor
Name:
BDBM50373835
Synonyms:
CHEMBL256202
Type:
Small organic molecule
Emp. Form.:
C18H28ClN3O
Mol. Mass.:
337.887
SMILES:
CCCCCC(=O)Nc1ccc(N2CCN(CC)CC2)c(Cl)c1
: