Target
Prostaglandin E2 receptor EP4 subtype
Ligand
BDBM50213980
Substrate
Meas. Tech.
ChEMBL_468780 (CHEMBL933110)
EC50
0.04±n/a nM
Citation
 Xiao, YAraldi, GLZhao, ZReddy, AKarra, SBrugger, NFischer, DPalmer, EBao, BMcKenna, SD Synthesis and evaluation of a gamma-lactam as a highly selective EP2 and EP4 receptor agonist. Bioorg Med Chem Lett 18:821-4 (2008)  
Target
Name:
Prostaglandin E2 receptor EP4 subtype
Synonyms:
PE2R4_HUMAN PGE2 receptor EP4 subtype PTGER4 Prostanoid EP4 receptor
Type:
Enzyme
Mol. Mass.:
53134.53
Organism:
Homo sapiens (Human)
Description:
P35408
Residue:
488
  
Inhibitor
Name:
BDBM50213980
Synonyms:
4-(2-((R)-2-((S)-3-hydroxyhept-1-enyl)-5-oxopyrrolidin-1-yl)ethyl)benzoate CHEMBL251294
Type:
Small organic molecule
Emp. Form.:
C20H27NO4
Mol. Mass.:
345.4327
SMILES:
CCCC[C@H](O)\C=C\[C@H]1CCC(=O)N1CCc1ccc(cc1)C(O)=O
: