Target
Histamine H3 receptor
Ligand
BDBM50374092
Substrate
Meas. Tech.
ChEMBL_468943 (CHEMBL930591)
Ki
256±n/a nM
Citation
 Santora, VJCovel, JAHayashi, RHofilena, BJIbarra, JBPulley, MDWeinhouse, MISengupta, DDuffield, JJSemple, GWebb, RRSage, CRen, APereira, GKnudsen, JEdwards, JESuarez, MFrazer, JThomsen, WHauser, EWhelan, KGrottick, AJ A new family of H3 receptor antagonists based on the natural product Conessine. Bioorg Med Chem Lett 18:1490-4 (2008)  
Target
Name:
Histamine H3 receptor
Synonyms:
HH3R Hrh3
Type:
G Protein-Coupled Receptor (GPCR)
Mol. Mass.:
48607.98
Organism:
Rattus norvegicus (rat)
Description:
Residue:
445
  
Inhibitor
Name:
BDBM50374092
Synonyms:
CHEMBL437404
Type:
Small organic molecule
Emp. Form.:
C30H32N2
Mol. Mass.:
420.5885
SMILES:
C(Cc1ccc(cc1)C1=CCC2CN(Cc3ccccc3)CC12)N1Cc2ccccc2C1
: