Target
Histamine H3 receptor
Ligand
BDBM50374096
Substrate
Meas. Tech.
ChEMBL_468943 (CHEMBL930591)
Ki
58±n/a nM
Citation
 Santora, VJCovel, JAHayashi, RHofilena, BJIbarra, JBPulley, MDWeinhouse, MISengupta, DDuffield, JJSemple, GWebb, RRSage, CRen, APereira, GKnudsen, JEdwards, JESuarez, MFrazer, JThomsen, WHauser, EWhelan, KGrottick, AJ A new family of H3 receptor antagonists based on the natural product Conessine. Bioorg Med Chem Lett 18:1490-4 (2008)  
Target
Name:
Histamine H3 receptor
Synonyms:
HH3R Hrh3
Type:
G Protein-Coupled Receptor (GPCR)
Mol. Mass.:
48607.98
Organism:
Rattus norvegicus (rat)
Description:
Residue:
445
  
Inhibitor
Name:
BDBM50374096
Synonyms:
CHEMBL404753
Type:
Small organic molecule
Emp. Form.:
C27H35N3
Mol. Mass.:
401.5869
SMILES:
CN1CCN(CCc2ccc(cc2)C2=CCC3CN(Cc4ccccc4)CC23)CC1
: