Target
Epidermal growth factor receptor
Ligand
BDBM3259
Substrate
Meas. Tech.
ChEMBL_468986 (CHEMBL952131)
IC50
347±n/a nM
Citation
 Kolb, PHuang, DDey, FCaflisch, A Discovery of kinase inhibitors by high-throughput docking and scoring based on a transferable linear interaction energy model. J Med Chem 51:1179-88 (2008)  
Target
Name:
Epidermal growth factor receptor
Synonyms:
EGF Receptor Substrate EGFR_HUMAN ERBB1 Epidermal Growth Factor Receptor erbB-1 Epidermal growth factor receptor (EGFR) HER1 Proto-oncogene c-ErbB-1 Tyrosine-Protein Kinase ErbB-1
Type:
Receptor Kinase Domain
Mol. Mass.:
134279.59
Organism:
Homo sapiens (Human)
Description:
P00533
Residue:
1210
  
Inhibitor
Name:
BDBM3259
Synonyms:
4-Anilino quinazoline deriv. 10 N-phenylquinazolin-4-amine
Type:
Small organic molecule
Emp. Form.:
C14H11N3
Mol. Mass.:
221.2572
SMILES:
N(c1ccccc1)c1ncnc2ccccc12
: