Target
Fatty-acid amide hydrolase 1 [30-579]
Ligand
BDBM50161512
Substrate
Meas. Tech.
ChEMBL_469283 (CHEMBL949127)
Ki
0.29±n/a nM
Citation
 Maryanoff, BECostanzo, MJ Inhibitors of proteases and amide hydrolases that employ an alpha-ketoheterocycle as a key enabling functionality. Bioorg Med Chem 16:1562-95 (2008)  
Target
Name:
Fatty-acid amide hydrolase 1 [30-579]
Synonyms:
Anandamide amidohydrolase 1 Faah Fatty Acid Amide Hydrolase Fatty-acid amide hydrolase (FAAH) Fatty-acid amide hydrolase 1 (FAAH) Oleamide hydrolase 1
Type:
Single-pass membrane protein; homodimer
Mol. Mass.:
60474.00
Organism:
Rattus norvegicus (rat)
Description:
P97612 (aa 30-579)
Residue:
550
  
Inhibitor
Name:
BDBM50161512
Synonyms:
7-Phenyl-1-(5-(pyridin-2-yl)-1,3,4-oxadiazol-2-yl)-heptan-1-one 7-phenyl-1-(5-(pyridin-2-yl)-1,3,4-oxadiazol-2-yl)heptan-1-one | CHEMBL178398
Type:
Small organic molecule
Emp. Form.:
C20H21N3O2
Mol. Mass.:
335.3996
SMILES:
O=C(CCCCCCc1ccccc1)c1nnc(o1)-c1ccccn1
: