Target
Interstitial collagenase
Ligand
BDBM50374195
Substrate
Meas. Tech.
ChEMBL_469433 (CHEMBL946791)
IC50
>1000±n/a nM
Citation
 Zhang, YMFan, XChakaravarty, DXiang, BScannevin, RHHuang, ZMa, JBurke, SLKarnachi, PRhodes, KJJackson, PF 1-Hydroxy-2-pyridinone-based MMP inhibitors: synthesis and biological evaluation for the treatment of ischemic stroke. Bioorg Med Chem Lett 18:409-13 (2008)  
Target
Name:
Interstitial collagenase
Synonyms:
CLG MMP1 Matrix metalloproteinase-1 | Matrix metalloproteinase-1 (MMP-1)
Type:
Enzyme
Mol. Mass.:
54010.26
Organism:
Homo sapiens (Human)
Description:
P03956
Residue:
469
  
Inhibitor
Name:
BDBM50374195
Synonyms:
CHEMBL257088
Type:
Small organic molecule
Emp. Form.:
C18H15ClN2O5S
Mol. Mass.:
406.84
SMILES:
CN(c1cccn(O)c1=O)S(=O)(=O)c1ccc(Oc2ccc(Cl)cc2)cc1
: