Target
Casein kinase II subunit alpha
Ligand
BDBM50374654
Substrate
Meas. Tech.
ChEMBL_469783 (CHEMBL947049)
Ki
1.4±n/a nM
Citation
 Nie, ZPerretta, CErickson, PMargosiak, SLu, JAverill, AAlmassy, RChu, S Structure-based design and synthesis of novel macrocyclic pyrazolo[1,5-a] [1,3,5]triazine compounds as potent inhibitors of protein kinase CK2 and their anticancer activities. Bioorg Med Chem Lett 18:619-23 (2008)  
Target
Name:
Casein kinase II subunit alpha
Synonyms:
ACK2 CK2- alpha Casein Kinase II
Type:
Enzyme
Mol. Mass.:
39238.74
Organism:
Zea mays (Maize)
Description:
Residue:
332
  
Inhibitor
Name:
BDBM50374654
Synonyms:
CHEMBL271645
Type:
Small organic molecule
Emp. Form.:
C30H35N9O2
Mol. Mass.:
553.658
SMILES:
CN(C1CCN(C)CC1)C(=O)c1cccc(Nc2nc3Nc4cccc(NC(=O)CCCCc5cnn2c5n3)c4)c1
: