Target
Peroxisome proliferator-activated receptor delta
Ligand
BDBM28750
Substrate
Meas. Tech.
ChEMBL_469929 (CHEMBL938398)
EC50
6±n/a nM
Citation
 Shen, LZhang, YWang, ASieber-McMaster, EChen, XPelton, PXu, JZYang, MZhu, PZhou, LReuman, MHu, ZRussell, RGibbs, ACRoss, HDemarest, KMurray, WVKuo, GH Synthesis and structure-activity relationships of thiadiazole-derivatives as potent and orally active peroxisome proliferator-activated receptors alpha/delta dual agonists. Bioorg Med Chem 16:3321-41 (2008)  
Target
Name:
Peroxisome proliferator-activated receptor delta
Synonyms:
NR1C2 NUCI Nuclear receptor subfamily 1 group C member 2 PPAR-beta PPARD Peroxisome proliferator-activated receptor Peroxisome proliferator-activated receptor delta
Type:
Enzyme
Mol. Mass.:
49910.45
Organism:
Homo sapiens (Human)
Description:
Q03181
Residue:
441
  
Inhibitor
Name:
BDBM28750
Synonyms:
2-methyl-2-{2-methyl-4-[({3-[4-(trifluoromethyl)phenyl]-1,2,4-thiadiazol-5-yl}methyl)sulfanyl]phenoxy}propanoic acid | [1,2,4]thiadiazole derivative, 15
Type:
Small organic molecule
Emp. Form.:
C21H19F3N2O3S2
Mol. Mass.:
468.512
SMILES:
Cc1cc(SCc2nc(ns2)-c2ccc(cc2)C(F)(F)F)ccc1OC(C)(C)C(O)=O
: