Target
Gastrin-releasing peptide receptor
Ligand
BDBM50374870
Substrate
Meas. Tech.
ChEMBL_470060 (CHEMBL933438)
EC50
0.373±n/a nM
Citation
 Dubuc, CLanglois, RBénard, FCauchon, NKlarskov, KTone, Pvan Lier, JE Targeting gastrin-releasing peptide receptors of prostate cancer cells for photodynamic therapy with a phthalocyanine-bombesin conjugate. Bioorg Med Chem Lett 18:2424-7 (2008)  
Target
Name:
Gastrin-releasing peptide receptor
Synonyms:
Bombesin 2 GRP-preferring bombesin receptor GRPR_HUMAN Gastrin-releasing peptide receptor
Type:
Enzyme Catalytic Domain
Mol. Mass.:
43214.53
Organism:
Homo sapiens (Human)
Description:
Bombesin 2 GRPR 0::P30550
Residue:
384
  
Inhibitor
Name:
BDBM50374870
Synonyms:
CHEMBL272335
Type:
Small organic molecule
Emp. Form.:
C57H91N15O11S
Mol. Mass.:
1194.491
SMILES:
CSCC[C@H](NC(=O)[C@H](CC(C)C)NC(=O)[C@H](Cc1cnc[nH]1)NC(=O)CNC(=O)[C@@H](NC(=O)[C@H](C)NC(=O)[C@H](Cc1c[nH]c2ccccc12)NC(=O)[C@H](CCC(N)=O)NC(=O)CCCCCCCNC(=O)CCCCCN)C(C)C)C(N)=O
: