Target
Dipeptidyl peptidase 4
Ligand
BDBM50374938
Substrate
Meas. Tech.
ChEMBL_470078 (CHEMBL933456)
IC50
0.210±n/a nM
Citation
 Edmondson, SDWei, LXu, JShang, JXu, SPang, JChaudhary, ADean, DCHe, HLeiting, BLyons, KAPatel, RAPatel, SBScapin, GWu, JKBeconi, MGThornberry, NAWeber, AE Fluoroolefins as amide bond mimics in dipeptidyl peptidase IV inhibitors. Bioorg Med Chem Lett 18:2409-13 (2008)  
Target
Name:
Dipeptidyl peptidase 4
Synonyms:
ADABP Adenosine deaminase complexing protein 2 CD_antigen=CD26 DPP4 DPPIV Dipeptidyl peptidase 4 (DPP IV) Dipeptidyl peptidase 4 (DPP4) Dipeptidyl peptidase 4 membrane form Dipeptidyl peptidase IV Dipeptidyl peptidase IV (DDP-IV) Dipeptidyl peptidase IV membrane form Dipeptidyl peptidase-IV (DPP-4) T-cell activation antigen CD26 | TP103
Type:
Enzyme
Mol. Mass.:
88271.01
Organism:
Homo sapiens (Human)
Description:
P27487
Residue:
766
  
Inhibitor
Name:
BDBM50374938
Synonyms:
CHEMBL402163
Type:
Small organic molecule
Emp. Form.:
C21H25ClFN3O3S
Mol. Mass.:
453.958
SMILES:
[#6]S(=O)(=O)c1ccc(-c2noc(n2)-[#6@@H](-[#6]-[#6]-2-[#6]-[#6]-2)-[#6@H](-[#7])-[#6](\F)=[#6]-2/[#6]-[#6]-[#6]-[#6]-2)c(Cl)c1
: