Target
Cannabinoid receptor 1
Ligand
BDBM50375102
Substrate
Meas. Tech.
ChEMBL_470255 (CHEMBL950210)
IC50
26.7±n/a nM
Citation
 Kang, SYLee, SHSeo, HJJung, MEAhn, KKim, JLee, J Tetrazole-biarylpyrazole derivatives as cannabinoid CB1 receptor antagonists. Bioorg Med Chem Lett 18:2385-9 (2008)  
Target
Name:
Cannabinoid receptor 1
Synonyms:
Brain-type cannabinoid receptor CB-R CNR1_RAT Cannabinoid receptor Cnr1 | Skr6
Type:
G Protein-Coupled Receptor (GPCR)
Mol. Mass.:
52856.55
Organism:
Rattus norvegicus (rat)
Description:
P20272
Residue:
473
  
Inhibitor
Name:
BDBM50375102
Synonyms:
CHEMBL263915
Type:
Small organic molecule
Emp. Form.:
C24H23Cl3N6
Mol. Mass.:
501.839
SMILES:
Cc1c(nn(c1-c1ccc(Cl)cc1)-c1ccc(Cl)cc1Cl)-c1nnnn1C1CCCCCC1
: