Target
Macrophage colony-stimulating factor 1 receptor
Ligand
BDBM50375146
Substrate
Meas. Tech.
ChEMBL_470263 (CHEMBL950218)
IC50
280±n/a nM
Citation
 Huang, HHutta, DAHu, HDesJarlais, RLSchubert, CPetrounia, IPChaikin, MAManthey, CLPlayer, MR Design and synthesis of a pyrido[2,3-d]pyrimidin-5-one class of anti-inflammatory FMS inhibitors. Bioorg Med Chem Lett 18:2355-61 (2008)  
Target
Name:
Macrophage colony-stimulating factor 1 receptor
Synonyms:
CSF1R FMS Macrophage colony stimulating factor receptor Macrophage colony-stimulating factor 1 receptor (c-FMS) Proto-oncogene c-Fms c-fms | cFMS
Type:
Protein
Mol. Mass.:
107979.48
Organism:
Homo sapiens (Human)
Description:
P07333
Residue:
972
  
Inhibitor
Name:
BDBM50375146
Synonyms:
CHEMBL271460
Type:
Small organic molecule
Emp. Form.:
C23H19N5O2
Mol. Mass.:
397.4293
SMILES:
NC(=O)c1cn(-c2ccc3CCCc3c2)c2nc(Nc3ccccc3)ncc2c1=O
: