Target
Aldo-keto reductase family 1 member C21
Ligand
BDBM50038843
Substrate
Meas. Tech.
ChEMBL_470435 (CHEMBL936590)
IC50
27500±n/a nM
Citation
 Dhagat, UEndo, SHara, AEl-Kabbani, O Inhibition of 3(17)alpha-hydroxysteroid dehydrogenase (AKR1C21) by aldose reductase inhibitors. Bioorg Med Chem 16:3245-54 (2008)  
Target
Name:
Aldo-keto reductase family 1 member C21
Synonyms:
AK1CL_MOUSE | Akr1c21
Type:
PROTEIN
Mol. Mass.:
36879.72
Organism:
Mus musculus
Description:
ChEMBL_470435
Residue:
323
  
Inhibitor
Name:
BDBM50038843
Synonyms:
(4R)-2-(4-bromo-2-fluorobenzyl)-6-fluoro-1H,2'H,5'H-spiro[isoquinoline-4,3'-pyrrolidine]-1,2',3,5'(2H)-tetrone 2-(4-bromo-2-fluorobenzyl)-6-fluoro-1H,2'H,5'H-spiro[isoquinoline-4,3'-pyrrolidine]-1,2',3,5'(2H)-tetrone 2[4-BROMO-2-FLUOROPHENYL)METHYL]-6-FLUOROSPIRO[ISOQUINOLINE-4-(1H),3'-PYRROLIDINE]-1,2',3,5'(2H)-TETRONE minalrestat
Type:
Small organic molecule
Emp. Form.:
C19H11BrF2N2O4
Mol. Mass.:
449.202
SMILES:
Fc1ccc2C(=O)N(Cc3ccc(Br)cc3F)C(=O)[C@]3(CC(=O)NC3=O)c2c1
: