Target
Lanosterol 14-alpha demethylase
Ligand
BDBM35346
Substrate
Meas. Tech.
ChEMBL_470779 (CHEMBL934981)
IC50
4000±n/a nM
Citation
 Ekins, SMankowski, DCHoover, DJLawton, MPTreadway, JLHarwood, HJ Three-dimensional quantitative structure-activity relationship analysis of human CYP51 inhibitors. Drug Metab Dispos 35:493-500 (2007)  
Target
Name:
Lanosterol 14-alpha demethylase
Synonyms:
CP51A_HUMAN CYP51A1 Cytochrome P450 51 LDM P450-14DM P450LI Sterol 14-alpha demethylase
Type:
Protein
Mol. Mass.:
56817.21
Organism:
Homo sapiens (Human)
Description:
Q16850
Residue:
503
  
Inhibitor
Name:
BDBM35346
Synonyms:
(S)-5-chloro-N-(3-(4-fluorophenyl)-1-(4-hydroxypiperidin-1-yl)-1-oxopropan-2-yl)-1H-indole-2-carboxamide 5-Chloro-1H-indole-2-carboxylic acid [(S)-1-(4-fluoro-benzyl)-2-(4-hydroxy-piperidin-1-yl)-2-oxo-ethyl]-amide CP-320626
Type:
Small organic molecule
Emp. Form.:
C23H23ClFN3O3
Mol. Mass.:
443.898
SMILES:
OC1CCN(CC1)C(=O)[C@H](Cc1ccc(F)cc1)NC(=O)c1cc2cc(Cl)ccc2[nH]1
: