Target
Thyroid hormone receptor beta
Ligand
BDBM50375342
Substrate
Meas. Tech.
ChEMBL_471201 (CHEMBL939180)
Kd
68±n/a nM
Citation
 Ocasio, CAScanlan, TS Characterization of thyroid hormone receptor alpha (TRalpha)-specific analogs with varying inner- and outer-ring substituents. Bioorg Med Chem 16:762-70 (2008)  
Target
Name:
Thyroid hormone receptor beta
Synonyms:
ERBA2 Nuclear receptor subfamily 1 group A member 2 THR1 c-erbA-2 | c-erbA-beta
Type:
Receptor
Mol. Mass.:
52793.62
Organism:
Homo sapiens (Human)
Description:
Recombinant hThR was obtained from nuclear extracts from SF9 cells infected with baculovirus vectors encoding for ThRbeta 1.
Residue:
461
  
Inhibitor
Name:
BDBM50375342
Synonyms:
CHEMBL258886
Type:
Small organic molecule
Emp. Form.:
C16H11BrI2N2O4
Mol. Mass.:
628.982
SMILES:
Oc1[nH]c(=O)[nH]c1Cc1cc(I)c(Oc2ccc(O)c(Br)c2)c(I)c1
: