Target
Thyroid hormone receptor beta
Ligand
BDBM36487
Substrate
Meas. Tech.
ChEMBL_471205 (CHEMBL939184)
EC50
58±n/a nM
Citation
 Ocasio, CAScanlan, TS Characterization of thyroid hormone receptor alpha (TRalpha)-specific analogs with varying inner- and outer-ring substituents. Bioorg Med Chem 16:762-70 (2008)  
Target
Name:
Thyroid hormone receptor beta
Synonyms:
ERBA2 Nuclear receptor subfamily 1 group A member 2 THR1 c-erbA-2 | c-erbA-beta
Type:
Receptor
Mol. Mass.:
52793.62
Organism:
Homo sapiens (Human)
Description:
Recombinant hThR was obtained from nuclear extracts from SF9 cells infected with baculovirus vectors encoding for ThRbeta 1.
Residue:
461
  
Inhibitor
Name:
BDBM36487
Synonyms:
CHEMBL263630 | CO23
Type:
Small organic molecule
Emp. Form.:
C19H18I2N2O4
Mol. Mass.:
592.1662
SMILES:
CC(C)c1cc(Oc2c(I)cc(Cc3[nH]c(=O)[nH]c3O)cc2I)ccc1O
: