Target
Cruzipain
Ligand
BDBM50375354
Substrate
Meas. Tech.
ChEMBL_471525 (CHEMBL938460)
Ki
7.8±n/a nM
Citation
 Freitas, RFOprea, TIMontanari, CA 2D QSAR and similarity studies on cruzain inhibitors aimed at improving selectivity over cathepsin L. Bioorg Med Chem 16:838-53 (2008)  
Target
Name:
Cruzipain
Synonyms:
CYSP_TRYCR Cruzaine | Major cysteine proteinase
Type:
Protein
Mol. Mass.:
49831.41
Organism:
Trypanosoma cruzi
Description:
P25779
Residue:
467
  
Inhibitor
Name:
BDBM50375354
Synonyms:
CHEMBL258808
Type:
Small organic molecule
Emp. Form.:
C27H36N2O4S
Mol. Mass.:
484.651
SMILES:
CC(C)C[C@H](NC(=O)OCc1ccccc1)C(=O)N[C@@H](Cc1ccccc1)C(=O)CSC(C)C
: