Target
Prostaglandin G/H synthase 2
Ligand
BDBM50375402
Substrate
Meas. Tech.
ChEMBL_471743 (CHEMBL921015)
IC50
420±n/a nM
Citation
 Chowdhury, MADong, YChen, QHAbdellatif, KRKnaus, EE Synthesis and cyclooxygenase inhibitory activities of linear 1-(methanesulfonylphenyl or benzenesulfonamido)-2-(pyridyl)acetylene regioisomers. Bioorg Med Chem 16:1948-56 (2008)  
Target
Name:
Prostaglandin G/H synthase 2
Synonyms:
COX2 Cyclooxygenase-2 (COX-2) PTGS2 Prostaglandin G/H synthase (cyclooxygenase)
Type:
Protein
Mol. Mass.:
68976.98
Organism:
Ovis aries (Sheep)
Description:
Residue:
603
  
Inhibitor
Name:
BDBM50375402
Synonyms:
CHEMBL404927
Type:
Small organic molecule
Emp. Form.:
C15H13NO2S
Mol. Mass.:
271.334
SMILES:
Cc1cccnc1C#Cc1ccccc1S(C)(=O)=O
: