Target
Adenosine receptor A2a
Ligand
BDBM50003217
Substrate
Meas. Tech.
ChEMBL_471788 (CHEMBL939996)
Ki
324±n/a nM
Citation
 Stefanachi, ABrea, JMCadavid, MICenteno, NBEsteve, CLoza, MIMartinez, ANieto, RRaviña, ESanz, FSegarra, VSotelo, EVidal, BCarotti, A 1-, 3- and 8-substituted-9-deazaxanthines as potent and selective antagonists at the human A2B adenosine receptor. Bioorg Med Chem 16:2852-69 (2008)  
Target
Name:
Adenosine receptor A2a
Synonyms:
A2A adenosine receptor (hA2A) ADENOSINE A2 ADORA2 Adenosine A2A receptor (A2AAR)
Type:
G Protein-Coupled Receptor (GPCR)
Mol. Mass.:
44716.46
Organism:
Homo sapiens (Human)
Description:
P29274
Residue:
412
  
Inhibitor
Name:
BDBM50003217
Synonyms:
CHEMBL259733
Type:
Small organic molecule
Emp. Form.:
C26H26FN5O4
Mol. Mass.:
491.5141
SMILES:
Cn1c2cc([nH]c2c(=O)n(C)c1=O)-c1ccc(OCC(=O)N2CCN(CC2)c2ccc(F)cc2)cc1
: