Target
Ribonuclease pancreatic
Ligand
BDBM50375419
Substrate
Meas. Tech.
ChEMBL_471807 (CHEMBL940091)
Ki
95000±n/a nM
Citation
 Ghosh, KSDebnath, JDutta, PSahoo, BKDasgupta, S Exploring the potential of 3'-O-carboxy esters of thymidine as inhibitors of ribonuclease A and angiogenin. Bioorg Med Chem 16:2819-28 (2008)  
Target
Name:
Ribonuclease pancreatic
Synonyms:
RIB1 RNASE1 RNS1 Ribonuclease pancreatic
Type:
Protein
Mol. Mass.:
17653.66
Organism:
Homo sapiens (Human)
Description:
Residue:
156
  
Inhibitor
Name:
BDBM50375419
Synonyms:
CHEMBL259808
Type:
Small organic molecule
Emp. Form.:
C17H18N2O6
Mol. Mass.:
346.3346
SMILES:
Cc1cn([C@H]2C[C@H](OC(=O)c3ccccc3)[C@@H](CO)O2)c(=O)[nH]c1=O
: