Target
Sterol carrier protein 2
Ligand
BDBM50375422
Substrate
Meas. Tech.
ChEMBL_472006 (CHEMBL922363)
Kd
339±n/a nM
Citation
 Black, SLStanley, WAFilipp, FVBhairo, MVerma, AWichmann, OSattler, MWilmanns, MSchultz, C Probing lipid- and drug-binding domains with fluorescent dyes. Bioorg Med Chem 16:1162-73 (2008)  
Target
Name:
Sterol carrier protein 2
Synonyms:
NSL-TP Propanoyl-CoA C-acyltransferase SCP-X SCP2 SCPX Sterol carrier protein X
Type:
PROTEIN
Mol. Mass.:
58995.50
Organism:
Homo sapiens (Human)
Description:
ChEMBL_472007
Residue:
547
  
Inhibitor
Name:
BDBM50375422
Synonyms:
CHEMBL260520
Type:
Small organic molecule
Emp. Form.:
C24H24N2O5
Mol. Mass.:
420.4578
SMILES:
CCN(CC)c1ccc2nc3c(cc(=O)c4ccc(OCCCC(O)=O)cc34)oc2c1
: