Target
5-hydroxytryptamine receptor 2C
Ligand
BDBM50180252
Substrate
Meas. Tech.
ChEMBL_472646 (CHEMBL921962)
Ki
16±n/a nM
Citation
 Shimada, IMaeno, KKazuta, KKubota, HKimizuka, TKimura, YHatanaka, KNaitou, YWanibuchi, FSakamoto, STsukamoto, S Synthesis and structure-activity relationships of a series of substituted 2-(1H-furo[2,3-g]indazol-1-yl)ethylamine derivatives as 5-HT2C receptor agonists. Bioorg Med Chem 16:1966-82 (2008)  
Target
Name:
5-hydroxytryptamine receptor 2C
Synonyms:
5-HT-2C 5-HT2C-INI 5-HTR2C 5-hydroxytryptamine receptor 2C (5-HT-2C) 5HT-1C HTR1C Serotonin (5-HT3) receptor Serotonin Receptor 2C
Type:
G Protein-Coupled Receptor (GPCR)
Mol. Mass.:
51836.79
Organism:
Homo sapiens (Human)
Description:
P28335
Residue:
458
  
Inhibitor
Name:
BDBM50180252
Synonyms:
(2S)-1-(6-methoxy-1H-indazol-1-yl)propan-2-amine CHEMBL199775
Type:
Small organic molecule
Emp. Form.:
C11H15N3O
Mol. Mass.:
205.2563
SMILES:
COc1ccc2cnn(C[C@H](C)N)c2c1
: