Target
Glycogen debranching enzyme
Ligand
BDBM50234571
Substrate
Meas. Tech.
ChEMBL_472699 (CHEMBL923883)
IC50
11000±n/a nM
Citation
 Minami, YKuriyama, CIkeda, KKato, ATakebayashi, KAdachi, IFleet, GWKettawan, AOkamoto, TAsano, N Effect of five-membered sugar mimics on mammalian glycogen-degrading enzymes and various glucosidases. Bioorg Med Chem 16:2734-40 (2008)  
Target
Name:
Glycogen debranching enzyme
Synonyms:
AGL GDE_HUMAN
Type:
PROTEIN
Mol. Mass.:
174768.28
Organism:
Homo sapiens (Human)
Description:
ChEMBL_491004
Residue:
1532
  
Inhibitor
Name:
BDBM50234571
Synonyms:
2,5-imino-2,5,6-trideoxy-D-manno-heptitol | CHEMBL407337
Type:
Small organic molecule
Emp. Form.:
C7H15NO4
Mol. Mass.:
177.1983
SMILES:
OCC[C@H]1N[C@H](CO)[C@@H](O)[C@@H]1O
: