Target
G-protein coupled bile acid receptor 1
Ligand
BDBM21680
Substrate
Meas. Tech.
ChEMBL_472949 (CHEMBL949256)
EC50
13600±n/a nM
Citation
 Sato, HMacchiarulo, AThomas, CGioiello, AUne, MHofmann, AFSaladin, RSchoonjans, KPellicciari, RAuwerx, J Novel potent and selective bile acid derivatives as TGR5 agonists: biological screening, structure-activity relationships, and molecular modeling studies. J Med Chem 51:1831-41 (2008)  
Target
Name:
G-protein coupled bile acid receptor 1
Synonyms:
BG37 GPBAR_HUMAN TGR5 hGPCR19
Type:
G Protein-Coupled Receptor (GPCR)
Mol. Mass.:
35260.02
Organism:
Homo sapiens (Human)
Description:
CHO cells transiently transfected with hTGR5.
Residue:
330
  
Inhibitor
Name:
BDBM21680
Synonyms:
(4R)-4-[(1S,2S,5R,7S,9R,10R,11S,14R,15R,16S)-5,9,16-trihydroxy-2,15-dimethyltetracyclo[8.7.0.0^{2,7}.0^{11,15}]heptadecan-14-yl]pentanoic acid 3alpha,7alpha,12alpha-trihydroxy-5beta-cholan-24-oic acid CHEMBL205596 Cholate cholicacid
Type:
Steroid
Emp. Form.:
C24H40O5
Mol. Mass.:
408.5714
SMILES:
[H][C@@]1(CC[C@@]2([H])[C@]3([H])[C@H](O)C[C@]4([H])C[C@H](O)CC[C@]4(C)[C@@]3([H])C[C@H](O)[C@]12C)[C@H](C)CCC(O)=O
: