Target
Transcription factor Jun
Ligand
BDBM50375643
Substrate
Meas. Tech.
ChEMBL_473715 (CHEMBL936812)
IC50
2030±n/a nM
Citation
 Fedorov, OMarsden, BPogacic, VRellos, PMüller, SBullock, ANSchwaller, JSundström, MKnapp, S A systematic interaction map of validated kinase inhibitors with Ser/Thr kinases. Proc Natl Acad Sci U S A 104:20523-8 (2007)  
Target
Name:
Transcription factor Jun
Synonyms:
AP1 JUN Proto-oncogene c-JUN Transcription factor AP1 p39
Type:
Mol. Mass.:
35683.24
Organism:
Homo sapiens (Human)
Description:
P05412
Residue:
331
  
Inhibitor
Name:
BDBM50375643
Synonyms:
CHEMBL261237 | SL-327
Type:
Small organic molecule
Emp. Form.:
C16H12F3N3S
Mol. Mass.:
335.347
SMILES:
Nc1ccc(SC(=N)C(C#N)c2ccccc2C(F)(F)F)cc1
: