Target
Myosin light chain kinase, smooth muscle
Ligand
BDBM50216680
Substrate
Meas. Tech.
ChEMBL_473613 (CHEMBL939381)
Ki
150000±n/a nM
Citation
 Fedorov, OMarsden, BPogacic, VRellos, PMüller, SBullock, ANSchwaller, JSundström, MKnapp, S A systematic interaction map of validated kinase inhibitors with Ser/Thr kinases. Proc Natl Acad Sci U S A 104:20523-8 (2007)  
Target
Name:
Myosin light chain kinase, smooth muscle
Synonyms:
KRP MLCK MYLK MYLK_HUMAN Telokin | smMLCK
Type:
Protein
Mol. Mass.:
210702.56
Organism:
Homo sapiens (Human)
Description:
Q15746
Residue:
1914
  
Inhibitor
Name:
BDBM50216680
Synonyms:
1-(2-(isoquinoline-5-sulfonamido)ethyl)guanidine H-1004 N-(2-guanidinoethyl)isoquinoline-5-sulfonamide
Type:
Small organic molecule
Emp. Form.:
C12H15N5O2S
Mol. Mass.:
293.345
SMILES:
[#7]\[#6](-[#7])=[#7]\[#6]-[#6]-[#7]S(=O)(=O)c1cccc2cnccc12
: