Target
Platelet-derived growth factor receptor beta
Ligand
BDBM50065308
Substrate
Meas. Tech.
ChEMBL_473651 (CHEMBL937669)
IC50
4000±n/a nM
Citation
 Fedorov, OMarsden, BPogacic, VRellos, PMüller, SBullock, ANSchwaller, JSundström, MKnapp, S A systematic interaction map of validated kinase inhibitors with Ser/Thr kinases. Proc Natl Acad Sci U S A 104:20523-8 (2007)  
Target
Name:
Platelet-derived growth factor receptor beta
Synonyms:
Beta-type platelet-derived growth factor receptor CD140b antigen PDGF Receptor Substrate PDGFR PDGFR-1 PDGFRB PGFRB_HUMAN Platelet-derived growth factor receptor 1 Platelet-derived growth factor receptor beta (PDGFR-beta) Platelet-derived growth factor receptor beta (PDGFRbeta) | VHL/PDGFRB
Type:
Enzyme
Mol. Mass.:
123922.25
Organism:
Homo sapiens (Human)
Description:
P09619
Residue:
1106
  
Inhibitor
Name:
BDBM50065308
Synonyms:
(Z )-3-[(2,4-dimethyl-3-(ethoxycarbonyl)pyrrol-5-yl)methylidenyl]indolin-2-one 2,4-Dimethyl-5-[2-oxo-1,2-dihydro-indol-(3Z)-ylidenemethyl]-1H-pyrrole-3-carboxylic acid ethyl ester | CHEMBL86943
Type:
Small organic molecule
Emp. Form.:
C18H18N2O3
Mol. Mass.:
310.3471
SMILES:
CCOC(=O)c1c(C)[nH]c(\C=C2/C(=O)Nc3ccccc23)c1C
: