Target
Protein kinase C beta type
Ligand
BDBM50153461
Substrate
Meas. Tech.
ChEMBL_473668 (CHEMBL921711)
IC50
5±n/a nM
Citation
 Fedorov, OMarsden, BPogacic, VRellos, PMüller, SBullock, ANSchwaller, JSundström, MKnapp, S A systematic interaction map of validated kinase inhibitors with Ser/Thr kinases. Proc Natl Acad Sci U S A 104:20523-8 (2007)  
Target
Name:
Protein kinase C beta type
Synonyms:
KPCB_HUMAN PKC beta PKCB PRKCB1 Protein kinase C beta type | Protein kinase C beta type II (PRKCB2)
Type:
Enzyme
Mol. Mass.:
76873.67
Organism:
Homo sapiens (Human)
Description:
The recombinant human PKC enzymes were produced using a baculovirus expression system in SF9 cells
Residue:
671
  
Inhibitor
Name:
BDBM50153461
Synonyms:
3-(1-(3-imidazol-1-ylpropyl)-1H-indol-3-yl)-4-anilino-1H-pyrrole-2,5-dione CHEMBL366266
Type:
Small organic molecule
Emp. Form.:
C24H21N5O2
Mol. Mass.:
411.4558
SMILES:
O=C1NC(=O)C(=C1Nc1ccccc1)c1cn(CCCn2ccnc2)c2ccccc12
: