Target
Phosphatidylinositol 3-kinase regulatory subunit alpha
Ligand
BDBM4622
Substrate
Meas. Tech.
ChEMBL_473680 (CHEMBL936779)
IC50
2±n/a nM
Citation
 Fedorov, OMarsden, BPogacic, VRellos, PMüller, SBullock, ANSchwaller, JSundström, MKnapp, S A systematic interaction map of validated kinase inhibitors with Ser/Thr kinases. Proc Natl Acad Sci U S A 104:20523-8 (2007)  
Target
Name:
Phosphatidylinositol 3-kinase regulatory subunit alpha
Synonyms:
GRB1 PI3-kinase class I PI3-kinase p85-alpha subunit PI3-kinase subunit p85-alpha PIK3CG/PIK3R1 Phosphatidylinositol 3-kinase 85 kDa regulatory subunit alpha (PI3K alpha) Phosphatidylinositol 3-kinase regulatory subunit alpha (PIK3R1) Phosphatidylinositol 3-kinase regulatory subunit alpha isoform 1 (PI3 Kinase alpha) Phosphatidylinositol 4,5-bisphosphate 3-kinase catalytic subunit alpha isoform (PI3Kalpha) PtdIns-3-kinase p85-alpha p85 alpha
Type:
Protein
Mol. Mass.:
83592.82
Organism:
Homo sapiens (Human)
Description:
P27986
Residue:
724
  
Inhibitor
Name:
BDBM4622
Synonyms:
3-[(6,7-dimethoxyquinazolin-4-yl)amino]phenol CHEMBL127907
Type:
Small organic molecule
Emp. Form.:
C16H15N3O3
Mol. Mass.:
297.3086
SMILES:
COc1cc2ncnc(Nc3cccc(O)c3)c2cc1OC
: