Target
DNA topoisomerase 2-alpha
Ligand
BDBM50004233
Substrate
Meas. Tech.
ChEMBL_473580 (CHEMBL939345)
IC50
3300±n/a nM
Citation
 Fedorov, OMarsden, BPogacic, VRellos, PMüller, SBullock, ANSchwaller, JSundström, MKnapp, S A systematic interaction map of validated kinase inhibitors with Ser/Thr kinases. Proc Natl Acad Sci U S A 104:20523-8 (2007)  
Target
Name:
DNA topoisomerase 2-alpha
Synonyms:
DNA topoisomerase 2-alpha DNA topoisomerase II (Topo II) DNA topoisomerase II, alpha isozyme TOP2A Topoisomerase I/II | Topoisomerase II alpha (HuTopoIIα)
Type:
Protein
Mol. Mass.:
174415.30
Organism:
Homo sapiens (Human)
Description:
P11388
Residue:
1531
  
Inhibitor
Name:
BDBM50004233
Synonyms:
5,11-dimethyl-2H-pyrido[4,3-b]carbazole ELLIPTECINE Ellipticine cid_3213
Type:
Small organic molecule
Emp. Form.:
C17H14N2
Mol. Mass.:
246.3065
SMILES:
Cc1c2[nH]c3ccccc3c2c(C)c2cnccc12
: