Target
Tyrosine-protein kinase Lck
Ligand
BDBM50375682
Substrate
Meas. Tech.
ChEMBL_473903 (CHEMBL950179)
IC50
1±n/a nM
Citation
 La, DSBelzile, JBready, JVCoxon, ADeMelfi, TDoerr, NEstrada, JFlynn, JCFlynn, SRGraceffa, RFHarriman, SPLarrow, JFLong, AMMartin, MWMorrison, MJPatel, VFRoveto, PMWang, LWeiss, MMWhittington, DATeffera, YZhao, ZPolverino, AJHarmange, JC Novel 2,3-dihydro-1,4-benzoxazines as potent and orally bioavailable inhibitors of tumor-driven angiogenesis. J Med Chem 51:1695-705 (2008)  
Target
Name:
Tyrosine-protein kinase Lck
Synonyms:
2.7.10.2 LCK_HUMAN Leukocyte C-terminal Src kinase Lymphocyte-specific protein tyrosine kinase Protein YT16 Proto-oncogene tyrosine-protein kinase LCK T cell-specific protein-tyrosine kinase
Type:
Mol. Mass.:
57987.83
Organism:
Homo sapiens (Human)
Description:
P06239
Residue:
509
  
Inhibitor
Name:
BDBM50375682
Synonyms:
CHEMBL270057
Type:
Small organic molecule
Emp. Form.:
C27H25N3O5
Mol. Mass.:
471.5045
SMILES:
COc1cc2nccc(Oc3ccc4N(CCOc4c3)C(=O)Nc3cccc(C)c3)c2cc1OC
: