Target
Vascular endothelial growth factor receptor 2
Ligand
BDBM50375690
Substrate
Meas. Tech.
ChEMBL_473898 (CHEMBL950174)
IC50
0.5±n/a nM
Citation
 La, DSBelzile, JBready, JVCoxon, ADeMelfi, TDoerr, NEstrada, JFlynn, JCFlynn, SRGraceffa, RFHarriman, SPLarrow, JFLong, AMMartin, MWMorrison, MJPatel, VFRoveto, PMWang, LWeiss, MMWhittington, DATeffera, YZhao, ZPolverino, AJHarmange, JC Novel 2,3-dihydro-1,4-benzoxazines as potent and orally bioavailable inhibitors of tumor-driven angiogenesis. J Med Chem 51:1695-705 (2008)  
Target
Name:
Vascular endothelial growth factor receptor 2
Synonyms:
CD_antigen=CD309 Fetal liver kinase 1 (FLK-1) KDR Protein-tyrosine kinase receptor Flk-1 VEGFR-2 VEGFR2 Vascular Endothelial Growth Factor Receptor Kinase 2 Vascular endothelial growth factor receptor 2 (KDR) Vascular endothelial growth factor receptor 2 (VEGFR2) Vascular endothelial growth factor receptor-2 (VEGFR-2)
Type:
Receptor Tyrosine Kinase
Mol. Mass.:
151510.97
Organism:
Homo sapiens (Human)
Description:
P35968
Residue:
1356
  
Inhibitor
Name:
BDBM50375690
Synonyms:
CHEMBL270954
Type:
Small organic molecule
Emp. Form.:
C27H24N4O5
Mol. Mass.:
484.5033
SMILES:
COc1cc2nccc(Oc3ccc4N(CCOc4c3)C(=O)Nc3ccc(C)cc3)c2cc1C(N)=O
: