Target
Arginase-1
Ligand
BDBM50375814
Substrate
Meas. Tech.
ChEMBL_474406 (CHEMBL938291)
Ki
17100±n/a nM
Citation
 Kotthaus, JSchade, DTöpker-Lehmann, KBeitz, EClement, B N(delta)-Methylated L-arginine derivatives and their effects on the nitric oxide generating system. Bioorg Med Chem 16:2305-12 (2008)  
Target
Name:
Arginase-1
Synonyms:
ARG1 Liver-type arginase | Type I arginase
Type:
PROTEIN
Mol. Mass.:
35008.90
Organism:
Bos taurus
Description:
ChEMBL_474406
Residue:
322
  
Inhibitor
Name:
BDBM50375814
Synonyms:
CHEMBL260628
Type:
Small organic molecule
Emp. Form.:
C7H16N4O4
Mol. Mass.:
220.2263
SMILES:
CN(CCC[C@H](N)C(O)=O)C(NO)N=O
: