Target
Progesterone receptor
Ligand
BDBM50375836
Substrate
Meas. Tech.
ChEMBL_474422 (CHEMBL934255)
IC50
15±n/a nM
Citation
 Fensome, AAdams, WRAdams, ALBerrodin, TJCohen, JHuselton, CIllenberger, AKern, JCHudak, VAMarella, MAMelenski, EGMcComas, CCMugford, CASlayden, ODYudt, MZhang, ZZhang, PZhu, YWinneker, RCWrobel, JE Design, synthesis, and SAR of new pyrrole-oxindole progesterone receptor modulators leading to 5-(7-fluoro-3,3-dimethyl-2-oxo-2,3-dihydro-1H-indol-5-yl)-1-methyl-1H-pyrrole-2-carbonitrile (WAY-255348). J Med Chem 51:1861-73 (2008)  
Target
Name:
Progesterone receptor
Synonyms:
NR3C3 PGR PRGR_HUMAN | progesterone
Type:
Protein
Mol. Mass.:
98979.52
Organism:
Homo sapiens (Human)
Description:
P06401
Residue:
933
  
Inhibitor
Name:
BDBM50375836
Synonyms:
CHEMBL271552
Type:
Small organic molecule
Emp. Form.:
C17H16FN3O
Mol. Mass.:
297.3268
SMILES:
CN1C(=O)C(C)(C)c2cc(cc(F)c12)-c1ccc(C#N)n1C
: