Target
Cannabinoid receptor 1
Ligand
BDBM50375861
Substrate
Meas. Tech.
ChEMBL_474602 (CHEMBL921108)
Ki
547±n/a nM
Citation
 Huffman, JWThompson, ALWiley, JLMartin, BR Synthesis and pharmacology of 1-deoxy analogs of CP-47,497 and CP-55,940. Bioorg Med Chem 16:322-35 (2008)  
Target
Name:
Cannabinoid receptor 1
Synonyms:
Brain-type cannabinoid receptor CB-R CNR1_RAT Cannabinoid receptor Cnr1 | Skr6
Type:
G Protein-Coupled Receptor (GPCR)
Mol. Mass.:
52856.55
Organism:
Rattus norvegicus (rat)
Description:
P20272
Residue:
473
  
Inhibitor
Name:
BDBM50375861
Synonyms:
CHEMBL408777 | JWH-337
Type:
Small organic molecule
Emp. Form.:
C24H40O2
Mol. Mass.:
360.5732
SMILES:
CCCCCCC(C)(C)c1ccc(cc1)[C@@H]1C[C@H](O)CC[C@H]1CCCO
: