Target
Cannabinoid receptor 1
Ligand
BDBM50375864
Substrate
Meas. Tech.
ChEMBL_474602 (CHEMBL921108)
Ki
>10000±n/a nM
Citation
 Huffman, JWThompson, ALWiley, JLMartin, BR Synthesis and pharmacology of 1-deoxy analogs of CP-47,497 and CP-55,940. Bioorg Med Chem 16:322-35 (2008)  
Target
Name:
Cannabinoid receptor 1
Synonyms:
Brain-type cannabinoid receptor CB-R CNR1_RAT Cannabinoid receptor Cnr1 | Skr6
Type:
G Protein-Coupled Receptor (GPCR)
Mol. Mass.:
52856.55
Organism:
Rattus norvegicus (rat)
Description:
P20272
Residue:
473
  
Inhibitor
Name:
BDBM50375864
Synonyms:
CHEMBL263632 | JWH-384
Type:
Small organic molecule
Emp. Form.:
C19H30O2
Mol. Mass.:
290.4403
SMILES:
CC(C)(C)c1ccc(cc1)[C@@H]1C[C@H](O)CC[C@H]1CCCO
: