Target
Cannabinoid receptor 1
Ligand
BDBM50375870
Substrate
Meas. Tech.
ChEMBL_474602 (CHEMBL921108)
Ki
8626±n/a nM
Citation
 Huffman, JWThompson, ALWiley, JLMartin, BR Synthesis and pharmacology of 1-deoxy analogs of CP-47,497 and CP-55,940. Bioorg Med Chem 16:322-35 (2008)  
Target
Name:
Cannabinoid receptor 1
Synonyms:
Brain-type cannabinoid receptor CB-R CNR1_RAT Cannabinoid receptor Cnr1 | Skr6
Type:
G Protein-Coupled Receptor (GPCR)
Mol. Mass.:
52856.55
Organism:
Rattus norvegicus (rat)
Description:
P20272
Residue:
473
  
Inhibitor
Name:
BDBM50375870
Synonyms:
CHEMBL260005 | JWH-297
Type:
Small organic molecule
Emp. Form.:
C18H28O
Mol. Mass.:
260.4143
SMILES:
CCCC(C)(C)c1ccc(cc1)[C@@H]1CCC[C@@H](O)C1
: