Target
Cannabinoid receptor 2
Ligand
BDBM50375863
Substrate
Meas. Tech.
ChEMBL_474603 (CHEMBL921109)
Ki
421±n/a nM
Citation
 Huffman, JWThompson, ALWiley, JLMartin, BR Synthesis and pharmacology of 1-deoxy analogs of CP-47,497 and CP-55,940. Bioorg Med Chem 16:322-35 (2008)  
Target
Name:
Cannabinoid receptor 2
Synonyms:
CANNABINOID CB2 CB2 CB2B CNR2_HUMAN Cannabinoid CB2 receptor Cannabinoid receptor 2 (CB2R) | hCB2
Type:
G Protein-Coupled Receptor (GPCR)
Mol. Mass.:
39690.94
Organism:
Homo sapiens (Human)
Description:
P34972
Residue:
360
  
Inhibitor
Name:
BDBM50375863
Synonyms:
CHEMBL259518 | JWH-385
Type:
Small organic molecule
Emp. Form.:
C26H44O2
Mol. Mass.:
388.6264
SMILES:
CCCCCCCCC(C)(C)c1ccc(cc1)[C@@H]1C[C@H](O)CC[C@H]1CCCO
: