Target
Cannabinoid receptor 2
Ligand
BDBM50375868
Substrate
Meas. Tech.
ChEMBL_474605 (CHEMBL921111)
EC50
39.6±n/a nM
Citation
 Huffman, JWThompson, ALWiley, JLMartin, BR Synthesis and pharmacology of 1-deoxy analogs of CP-47,497 and CP-55,940. Bioorg Med Chem 16:322-35 (2008)  
Target
Name:
Cannabinoid receptor 2
Synonyms:
CANNABINOID CB2 CB2 CB2B CNR2_HUMAN Cannabinoid CB2 receptor Cannabinoid receptor 2 (CB2R) | hCB2
Type:
G Protein-Coupled Receptor (GPCR)
Mol. Mass.:
39690.94
Organism:
Homo sapiens (Human)
Description:
P34972
Residue:
360
  
Inhibitor
Name:
BDBM50375868
Synonyms:
CHEMBL261495 | JWH-406
Type:
Small organic molecule
Emp. Form.:
C20H32O
Mol. Mass.:
288.4675
SMILES:
CCCCCC(C)(C)c1ccc(cc1)[C@@H]1CCC[C@@H](O)C1
: