Target
Aurora kinase A
Ligand
BDBM50236362
Substrate
Meas. Tech.
ChEMBL_474791 (CHEMBL951284)
IC50
371±n/a nM
Citation
 Weiss, MMHarmange, JCPolverino, AJBauer, DBerry, LBerry, VBorg, GBready, JChen, DChoquette, DCoxon, ADeMelfi, TDoerr, NEstrada, JFlynn, JGraceffa, RFHarriman, SPKaufman, SLa, DSLong, ANeervannan, SPatel, VFPotashman, MRegal, KRoveto, PMSchrag, MLStarnes, CTasker, ATeffera, YWhittington, DAZanon, R Evaluation of a series of naphthamides as potent, orally active vascular endothelial growth factor receptor-2 tyrosine kinase inhibitors. J Med Chem 51:1668-80 (2008)  
Target
Name:
Aurora kinase A
Synonyms:
AIK ARK-1 AURA AURKA_HUMAN Aurora 2 Aurora kinase A (AURKA) Aurora kinase A (Aurora-2) Aurora/IPL1-related kinase 1 Breast tumor-amplified kinase IAK1 STK15 GN Serine/threonine kinase 15 Serine/threonine-protein kinase 6 Serine/threonine-protein kinase aurora-A aurora-2 | hARK1
Type:
Serine/threonine-protein kinase
Mol. Mass.:
45830.98
Organism:
Homo sapiens (Human)
Description:
O14965
Residue:
403
  
Inhibitor
Name:
BDBM50236362
Synonyms:
CHEMBL429743 N-(4-chlorophenyl)-6-[(6,7-dimethoxyquinolin-4-yl)oxy]naphthalene-1-carboxamide
Type:
Small organic molecule
Emp. Form.:
C28H21ClN2O4
Mol. Mass.:
484.93
SMILES:
COc1cc2nccc(Oc3ccc4c(cccc4c3)C(=O)Nc3ccc(Cl)cc3)c2cc1OC
: