Target
Vascular endothelial growth factor receptor 3
Ligand
BDBM50236362
Substrate
Meas. Tech.
ChEMBL_474938 (CHEMBL934132)
IC50
2±n/a nM
Citation
 Harmange, JCWeiss, MMGermain, JPolverino, AJBorg, GBready, JChen, DChoquette, DCoxon, ADeMelfi, TDiPietro, LDoerr, NEstrada, JFlynn, JGraceffa, RFHarriman, SPKaufman, SLa, DSLong, AMartin, MWNeervannan, SPatel, VFPotashman, MRegal, KRoveto, PMSchrag, MLStarnes, CTasker, ATeffera, YWang, LWhite, RDWhittington, DAZanon, R Naphthamides as novel and potent vascular endothelial growth factor receptor tyrosine kinase inhibitors: design, synthesis, and evaluation. J Med Chem 51:1649-67 (2008)  
Target
Name:
Vascular endothelial growth factor receptor 3
Synonyms:
FLT-4 Fms-like tyrosine kinase 4 VEGFR-3 VGFR3_HUMAN Vascular endothelial growth factor receptor 3 (VEGFR-3) | Vascular endothelial growth factor receptor 3 (VEGFR3)
Type:
Protein
Mol. Mass.:
152749.58
Organism:
Homo sapiens (Human)
Description:
P35916-2
Residue:
1363
  
Inhibitor
Name:
BDBM50236362
Synonyms:
CHEMBL429743 N-(4-chlorophenyl)-6-[(6,7-dimethoxyquinolin-4-yl)oxy]naphthalene-1-carboxamide
Type:
Small organic molecule
Emp. Form.:
C28H21ClN2O4
Mol. Mass.:
484.93
SMILES:
COc1cc2nccc(Oc3ccc4c(cccc4c3)C(=O)Nc3ccc(Cl)cc3)c2cc1OC
: