Target
Vascular endothelial growth factor receptor 1
Ligand
BDBM50236362
Substrate
Meas. Tech.
ChEMBL_474964 (CHEMBL933144)
IC50
0.500000±n/a nM
Citation
 Harmange, JCWeiss, MMGermain, JPolverino, AJBorg, GBready, JChen, DChoquette, DCoxon, ADeMelfi, TDiPietro, LDoerr, NEstrada, JFlynn, JGraceffa, RFHarriman, SPKaufman, SLa, DSLong, AMartin, MWNeervannan, SPatel, VFPotashman, MRegal, KRoveto, PMSchrag, MLStarnes, CTasker, ATeffera, YWang, LWhite, RDWhittington, DAZanon, R Naphthamides as novel and potent vascular endothelial growth factor receptor tyrosine kinase inhibitors: design, synthesis, and evaluation. J Med Chem 51:1649-67 (2008)  
Target
Name:
Vascular endothelial growth factor receptor 1
Synonyms:
FLT FRT Fms-like tyrosine kinase 1 Tyrosine-protein kinase FRT VEGFR-1 VGFR1_HUMAN Vascular endothelial growth factor receptor 1 (FLT1) Vascular endothelial growth factor receptor 1 and 2 (Flt-1 and KDR) Vascular permeability factor receptor vascular endothelial growth factor/vascular permeability factor receptor
Type:
Receptor Tyrosine Kinase
Mol. Mass.:
150800.23
Organism:
Homo sapiens (Human)
Description:
P17948
Residue:
1338
  
Inhibitor
Name:
BDBM50236362
Synonyms:
CHEMBL429743 N-(4-chlorophenyl)-6-[(6,7-dimethoxyquinolin-4-yl)oxy]naphthalene-1-carboxamide
Type:
Small organic molecule
Emp. Form.:
C28H21ClN2O4
Mol. Mass.:
484.93
SMILES:
COc1cc2nccc(Oc3ccc4c(cccc4c3)C(=O)Nc3ccc(Cl)cc3)c2cc1OC
: