Target
Vascular endothelial growth factor receptor 2
Ligand
BDBM14974
Substrate
Meas. Tech.
ChEMBL_474871 (CHEMBL932834)
IC50
2±n/a nM
Citation
 Harmange, JCWeiss, MMGermain, JPolverino, AJBorg, GBready, JChen, DChoquette, DCoxon, ADeMelfi, TDiPietro, LDoerr, NEstrada, JFlynn, JGraceffa, RFHarriman, SPKaufman, SLa, DSLong, AMartin, MWNeervannan, SPatel, VFPotashman, MRegal, KRoveto, PMSchrag, MLStarnes, CTasker, ATeffera, YWang, LWhite, RDWhittington, DAZanon, R Naphthamides as novel and potent vascular endothelial growth factor receptor tyrosine kinase inhibitors: design, synthesis, and evaluation. J Med Chem 51:1649-67 (2008)  
Target
Name:
Vascular endothelial growth factor receptor 2
Synonyms:
CD_antigen=CD309 Fetal liver kinase 1 (FLK-1) KDR Protein-tyrosine kinase receptor Flk-1 VEGFR-2 VEGFR2 Vascular Endothelial Growth Factor Receptor Kinase 2 Vascular endothelial growth factor receptor 2 (KDR) Vascular endothelial growth factor receptor 2 (VEGFR2) Vascular endothelial growth factor receptor-2 (VEGFR-2)
Type:
Receptor Tyrosine Kinase
Mol. Mass.:
151510.97
Organism:
Homo sapiens (Human)
Description:
P35968
Residue:
1356
  
Inhibitor
Name:
BDBM14974
Synonyms:
CHEMBL221484 N-{3-[3-(dimethylamino)propyl]-5-(trifluoromethyl)phenyl}-4-methyl-3-{[3-(pyrimidin-4-yl)pyridin-2-yl]amino}benzamide | pyridinyl pyrimidine 39
Type:
Small organic molecule
Emp. Form.:
C29H29F3N6O
Mol. Mass.:
534.5754
SMILES:
CN(C)CCCc1cc(NC(=O)c2ccc(C)c(Nc3ncccc3-c3ccncn3)c2)cc(c1)C(F)(F)F
: